https://identifier.overheid.nl/tooi/set/scw_filetypes/3
type: Ontology
imports: core
imports: ont
imports: wl
imports: pav
type: SchemagebaseerdeConceptwaardelijst
schema: file-type
derived from: xtrn
verantwoordelijke: mnre1034
description: Waardelijst met een selectie van filetypes uit de EU Vocabulary Authority table voor filetypes (filetypes-skos-ap-act.rdf). Deze selectie wordt bepaald door de bestandsformaten die relevant zijn voor de publicatievoorzieningen van overheid.nl.
publicatiedatum: 2024-04-11
titel: Filetypes
volgnummer: 3
version info: Met WLPUB Merge branch 'ccw-nieuw' #2835802 main 58a3858b
generated at time: 2024-04-11T15:00:43.859Z
zichtdatum: 2024-04-11

Atom Feed
top concept of: file-type
type: Concept
in scheme: file-type
notation: ATOM
notation: application/atom+xml
notation: atom
notation: xml
definition: The Atom Feed or Atom Syndication Format is an XML language used for web feeds. Web feeds allow software programs to check for updates published on a website.

Amazon Kindle eBook
top concept of: file-type
type: Concept
in scheme: file-type
notation: AZW
notation: application/vnd.amazon.ebook
notation: azw
definition: AZW Kindle File Format is a proprietary e-book file format created by Amazon.com that can be downloaded and read on devices like smartphones, tablets, computers or e-readers that have Amazon's Kindle application.

Bitmap Image File
top concept of: file-type
type: Concept
in scheme: file-type
notation: BMP
notation: bm
notation: bmp
notation: dib
notation: image/x-ms-bmp
definition: The bitmap image (BMP) or device independent bitmap (DIB) is a raster graphics image file format used to store bitmap digital images, independently of the display device.

BWF
top concept of: file-type
type: Concept
in scheme: file-type
notation: BWF
notation: audio/vnd.wave
notation: bwf
notation: wav
definition: BWF – Broadcast Wave Format – is an extension of the Microsoft WAV audio format and is the recording format of most file-based non-linear digital recorders used for motion picture, radio and television production. The purpose of this file format is the addition of metadata to facilitate the seamless exchange of sound data between different computer platforms and applications.

CSS
top concept of: file-type
type: Concept
in scheme: file-type
notation: CSS
notation: css
notation: text/css
definition: CSS – Cascading Style Sheets – is a style sheet language used for describing the presentation of a document written in a markup language.

CSV
top concept of: file-type
type: Concept
in scheme: file-type
notation: CSV
notation: csv
notation: text/csv
definition: CSV – comma-separated values – files store tabular data (numbers and text) in plain text. Each line of the file is a data record. Each record consists of one or more fields, separated by commas.

DBF
top concept of: file-type
type: Concept
in scheme: file-type
notation: DBF
notation: application/x-dbase
notation: dbf
definition: DBF – dBase database file – is supported by a number of database products. dBase was one of the first database management systems for microcomputers.

Word DOC
top concept of: file-type
type: Concept
in scheme: file-type
notation: DOC
notation: application/msword
notation: doc
definition: DOC is a proprietary binary Word document format used by Microsoft Word word processor.

Word DOCX
top concept of: file-type
type: Concept
in scheme: file-type
notation: DOCX
notation: application/vnd.openxmlformats-officedocument.wordprocessingml.document
notation: docx
definition: DOCX is an Office Open XML international standard for Office documents. It is used by Microsoft Word and by a growing number of applications from other vendors in word processing programs.

SGML DTD
top concept of: file-type
type: Concept
in scheme: file-type
notation: DTD_SGML
notation: application/sgml
notation: dtd
definition: SGML – Standard Generalized Markup Language – is a standard for defining generalized markup languages for documents. DTD – document type definition – is a set of markup declarations that define a document type for an SGML-family markup language (SGML, XML, HTML). It defines the legal building blocks of an XML document, the document structure with a list of legal elements and attributes.

XML DTD
top concept of: file-type
type: Concept
in scheme: file-type
notation: DTD_XML
notation: application/xml-dtd
notation: dtd
definition: XML – Extensible Markup Language – is a markup language that defines a set of rules for encoding documents in a format that is both human-readable and machine-readable. DTD – document type definition – is a set of markup declarations that define a document type for an SGML-family markup language (SGML, XML, HTML). It defines the legal building blocks of an XML document, the document structure with a list of legal elements and attributes. XML uses a subset of SGML DTD.

E00
top concept of: file-type
type: Concept
in scheme: file-type
notation: E00
notation: application/x-e00
notation: e00
definition: E00 is an ArcInfo interchange file format. ArcInfo is a full-featured geographic information system produced by Esri.

ECW
top concept of: file-type
type: Concept
in scheme: file-type
notation: ECW
notation: application/x-ecw
notation: ecw
definition: ECW – Enhanced Compressed Wavelet – is the media type which shall be used for a proprietary wavelet compression image format optimized for aerial and satellite imagery.

Encapsulated Postscript
top concept of: file-type
type: Concept
in scheme: file-type
notation: EPS
notation: application/postscript
notation: eps
definition: EPS – Encapsulated PostScript – files are more-or-less self-contained, reasonably predictable PostScript documents that describe an image or drawing and can be placed within another PostScript document.

EPUB
top concept of: file-type
type: Concept
in scheme: file-type
notation: EPUB
notation: application/epub+zip
notation: epub
definition: EPUB – electronic publication – is an e-book file format that can be downloaded and read on devices like smartphones, tablets, computers or e-readers. It is a technical standard published by the International Digital Publishing Forum (IDPF).

Formex 2
top concept of: file-type
type: Concept
in scheme: file-type
notation: FMX2
notation: text/sgml
notation: xml
definition: Formex describes the format for the exchange of data between the Publication Office and its contractors. In particular, it defines the logical markup for documents which are published in the different series of the Offical Journal of the European Union. Formex 2 was a previous version of Formex actually used.

Formex 3
top concept of: file-type
type: Concept
in scheme: file-type
notation: FMX3
notation: text/sgml
notation: xml
definition: Formex describes the format for the exchange of data between the Publication Office and its contractors. In particular, it defines the logical markup for documents which are published in the different series of the Offical Journal of the European Union. Formex 3 was a previous version of Formex actually used.

Formex 4
top concept of: file-type
type: Concept
in scheme: file-type
notation: FMX4
notation: application/xml
notation: xml
definition: Formex describes the format for the exchange of data between the Publication Office and its contractors. In particular, it defines the logical markup for documents which are published in the different series of the Offical Journal of the European Union. Formex V4 is based on the international standard XML.

Esri File Geodatabase
top concept of: file-type
type: Concept
in scheme: file-type
notation: GDB
notation: application/x-filegdb
notation: gdb
definition: GDB is an Esri's file-based geodatabase format, stored as folders in a file system. It shall be used for Esri file geodatabases. The file is a zip archive that contains the gdb directory.

GIF
top concept of: file-type
type: Concept
in scheme: file-type
notation: GIF
notation: gif
notation: image/gif
definition: GIF – Graphics Interchange Format – is a bitmap image format that was developed by a team at the bulletin board service (BBS) provider CompuServe.

GML
top concept of: file-type
type: Concept
in scheme: file-type
notation: GML
notation: application/gml+xml
notation: gml .xml
definition: GML – Geography Markup Language – is the XML grammar defined by the Open Geospatial Consortium (OGC) to express geographical features. GML serves as a modeling language for geographic systems as well as an open interchange format for geographic transactions on the Internet.

GNU zip
top concept of: file-type
type: Concept
in scheme: file-type
notation: GZIP
notation: application/gzip
notation: application/x-gzip
notation: gz
definition: GZIP – GNU zip – is a file format and a software application used for file compression and decompression.

HDF
top concept of: file-type
type: Concept
in scheme: file-type
notation: HDF
notation: application/x-hdf
notation: h4
notation: h5
notation: hdf
notation: hdf4
notation: hdf5
notation: he2
notation: he5
definition: HDF is a set of file formats (HDF4, HDF5) designed to store and organize large amounts of numerical data.

HTML
top concept of: file-type
type: Concept
in scheme: file-type
notation: HTML
notation: htm
notation: html
notation: text/html
definition: HTML is the standard markup language used to create web pages and its elements form the building blocks of all websites.

INDD
top concept of: file-type
type: Concept
in scheme: file-type
notation: INDD
notation: application/x-indesign
notation: indd
definition: INDD is a file format for a page layout file used by Adobe InDesign. InDesign is a desktop publishing software application.

JPEG
top concept of: file-type
type: Concept
in scheme: file-type
notation: JPEG
notation: image/jpeg
notation: jpeg
notation: jpg
definition: JPEG – Joint Photographic Experts Group – is a commonly used method of lossy compression for digital images, particularly for those images produced by digital photography. The degree of compression can be adjusted, allowing a selectable tradeoff between storage size and image quality.

JSON
top concept of: file-type
type: Concept
in scheme: file-type
notation: JSON
notation: application/json
notation: json
definition: JSON is an open-standard file format that uses human-readable text to transmit data objects consisting of attribute–value pairs and array data types (or any other serializable value). It is a very common data format used for asynchronous browser/server communication.

JSON-LD
top concept of: file-type
type: Concept
in scheme: file-type
notation: JSON_LD
notation: application/ld+json
notation: jsonld
definition: JSON-LD is a JSON-based format to serialize Linked Data. It is primarily intended to be a way to use Linked Data in Web-based programming environments, to build interoperable Web services, and to store Linked Data in JSON-based storage engines.

KML
top concept of: file-type
type: Concept
in scheme: file-type
notation: KML
notation: application/vnd.google-earth.kml+xml
notation: kml
definition: KML – Keyhole Markup Language – is an XML notation for expressing geographic annotation and visualization within Internet-based, two-dimensional maps and three-dimensional Earth browsers. KML was developed for use with Google Earth and became an international standard.

KMZ
top concept of: file-type
type: Concept
in scheme: file-type
notation: KMZ
notation: application/vnd.google-earth.kmz
notation: kmz
definition: A KMZ file consists of a main KML file and zero or more supporting files that are packaged using a Zip utility into one unit, called an archive. The KMZ file can then be stored and emailed as a single entity. A NetworkLink can fetch a KMZ file from a web server. When the KMZ file is unzipped, the main .kml file and its supporting files are separated into their original formats and directory structure, with their original filenames and extensions. In addition to being an archive format, the Zip format is also compressed, so an archive can include only a single large KML file. Depending on the content of the KML file, this process typically results in 10:1 compression. Your 10 Kbyte KML file can be served with a 1 Kbyte KMZ file.

ArcGIS Map Preview
top concept of: file-type
type: Concept
in scheme: file-type
notation: MAP_PRVW
notation: arcgis_map_preview
definition: Esri's ArcGIS is a geographic information system (GIS) for working with maps and geographic information. Map previews are normal raster background maps.

ArcGIS Map Service
top concept of: file-type
type: Concept
in scheme: file-type
notation: MAP_SRVC
notation: arcgis_map_service
definition: Esri's ArcGIS is a geographic information system (GIS) for working with maps and geographic information. Map services offer access to map and layer content.

MDB
top concept of: file-type
type: Concept
in scheme: file-type
notation: MDB
notation: application/vnd.ms-access
notation: application/x-msaccess
notation: mdb
definition: MDB – Microsoft Database – is a proprietary file format used by 2003 and earlier versions of Microsoft Access. Microsoft Access is a database management system.

METS XML
top concept of: file-type
type: Concept
in scheme: file-type
notation: METS
notation: application/xml
notation: xml
definition: METS – Metadata Encoding and Transmission Standard – is a metadata standard for encoding descriptive, administrative and structural metadata regarding objects within a digital library, expressed using the XML schema language.

METS package
top concept of: file-type
type: Concept
in scheme: file-type
notation: METS_ZIP
notation: application/zip
notation: zip
definition: METS package is a zip file containing METS XML files.

Mobipocket eBook
top concept of: file-type
type: Concept
in scheme: file-type
notation: MOBI
notation: application/x-mobipocket-ebook
notation: mobi
notation: prc
definition: Mobipocket eBook is a proprietary e-book file format of Mobipocket SA company that can be used by mobile phones, personal digital assistants (PDA) and desktop operating systems.

MOP
top concept of: file-type
type: Concept
in scheme: file-type
notation: MOP
notation: chemical/x-mopac-input
notation: mop
definition: MOP is a chemical file format used by MOPAC. MOPAC is a popular computer program used in computational chemistry. It is designed to implement semi-empirical quantum chemistry algorithms.

MPEG-2
top concept of: file-type
type: Concept
in scheme: file-type
notation: MPEG2
notation: audio/mpeg
notation: m2v
notation: mp2
notation: mp3
notation: mpeg
notation: mpg
notation: video/mpeg
definition: MPEG-2 – Moving Picture Experts Group – is a standard for the generic coding of moving pictures and associated audio information. It describes a combination of lossy video compression and lossy audio data compression methods, which permit storage and transmission of movies using currently available storage media and transmission bandwidth.

MPEG-4
top concept of: file-type
type: Concept
in scheme: file-type
notation: MPEG4
notation: application/mp4
notation: audio/mp4
notation: mp4
notation: mpeg
notation: mpg
notation: video/mp4
definition: MPEG-4 – Moving Picture Experts Group – is a method of defining compression of audio and visual (AV) digital data. It was designated a standard for a group of audio and video coding formats and related technology.

MXD
top concept of: file-type
type: Concept
in scheme: file-type
notation: MXD
notation: application/x-mxd
notation: mxd
definition: MXD – Map Exchange Document – is a file format in which the maps created from ArcGIS software can be stored.

ODF
top concept of: file-type
type: Concept
in scheme: file-type
notation: ODF
notation: application/octet-stream
notation: application/vnd.oasis.opendocument.formula
notation: odf
definition: ODF – Open Document Format for Office Applications, also known as OpenDocument – is an XML-based file format for spreadsheets, charts, presentations and word processing documents. It was developed with the aim of providing an open, XML-based file format specification for office applications.

ODP
top concept of: file-type
type: Concept
in scheme: file-type
notation: ODP
notation: application/vnd.oasis.opendocument.presentation
notation: fodp
notation: odp
definition: ODP is an OpenDocument file format for presentations. OpenDocument was developed with the aim of providing an open, XML-based file format specification for office applications.

ODS
top concept of: file-type
type: Concept
in scheme: file-type
notation: ODS
notation: application/vnd.oasis.opendocument.spreadsheet
notation: ods
definition: ODS is an OpenDocument file format for spreadsheets. OpenDocument was developed with the aim of providing an open, XML-based file format specification for office applications.

ODT
top concept of: file-type
type: Concept
in scheme: file-type
notation: ODT
notation: application/vnd.oasis.opendocument.text
notation: odt
definition: ODT is the word processing file format of OpenDocument, an open standard for electronic documents.

OWL
top concept of: file-type
type: Concept
in scheme: file-type
notation: OWL
notation: application/owl+xml
notation: owl
notation: owx
notation: rdf
definition: OWL – Web Ontology Language – is a family of knowledge representation languages for authoring ontologies.

PDF
top concept of: file-type
type: Concept
in scheme: file-type
notation: PDF
notation: application/pdf
notation: pdf
definition: PDF – Portable Document Format – is a file format developed to present documents, including text formatting and images, in a manner independent of application software, hardware and operating systems. Based on the PostScript language, each PDF file encapsulates a complete description of a fixed-layout flat document, including the text, fonts, vector graphics, raster images and other information needed to display it. PDF was standardized as an open format and does not require any royalties for its implementation.

PDF/A-1a
top concept of: file-type
type: Concept
in scheme: file-type
notation: PDFA1A
notation: application/pdf
notation: pdf
definition: PDF/A-1 is the Part 1 of the PDF standard and specifies two levels of conformance for PDF files. PDF/A-1a – Level A (accessible) conformance was intended to increase the accessibility of conforming files for physically impaired users by allowing assistive software, such as screen readers, to more precisely extract and interpret a file's contents.

PDF/A-1b
top concept of: file-type
type: Concept
in scheme: file-type
notation: PDFA1B
notation: application/pdf
notation: pdf
definition: PDF/A-1 is the Part 1 of the PDF standard and specifies two levels of conformance for PDF files. Level B (basic) conformance requires only that standards necessary for the reliable reproduction of a document's visual appearance be followed.

PDF/X
top concept of: file-type
type: Concept
in scheme: file-type
notation: PDFX
notation: application/pdf
notation: pdf
definition: PDF/X is a subset of the PDF standard. The purpose of PDF/X is to facilitate graphics exchange, and it therefore has a series of printing related requirements which do not apply to standard PDF files.

PNG
top concept of: file-type
type: Concept
in scheme: file-type
notation: PNG
notation: image/png
notation: png
definition: PNG – Portable Network Graphics – is a raster graphics file format that supports lossless data compression. PNG was created as an improved, non-patented replacement for Graphics Interchange Format (GIF), and is the most widely used lossless image compression format on the Internet.

PowerPoint Slide Show
top concept of: file-type
type: Concept
in scheme: file-type
notation: PPS
notation: application/vnd.ms-powerpoint
notation: pps
definition: PPS – PowerPoint 97–2003 binary slide show – is a binary filaname extension of Microsoft PowerPoint presentation program. PowerPoint was originally designed to provide visuals for group presentations within business organizations, but has come to be very widely used in many other communication situations, both in business and beyond.

PowerPoint PPSX
top concept of: file-type
type: Concept
in scheme: file-type
notation: PPSX
notation: application/vnd.openxmlformats-officedocument.presentationml.slideshow
notation: ppsx
definition: PPSX – PowerPoint 2007 XML slide show – is an XML filename extension of Microsoft PowerPoint presentation program. PowerPoint was originally designed to provide visuals for group presentations within business organizations, but has come to be very widely used in many other communication situations, both in business and beyond.

PowerPoint PPT
top concept of: file-type
type: Concept
in scheme: file-type
notation: PPT
notation: application/vnd.ms-powerpoint
notation: ppt
definition: PPT is a binary media type of Microsoft PowerPoint presentation program. PowerPoint was originally designed to provide visuals for group presentations within business organizations, but has come to be very widely used in many other communication situations, both in business and beyond.

PowerPoint PPTX
top concept of: file-type
type: Concept
in scheme: file-type
notation: PPTX
notation: application/vnd.openxmlformats-officedocument.presentationml.presentation
notation: pptx
definition: PPTX – PowerPoint 2007 XML presentation – is an XML filename extension of Office Open XML version of Microsoft PowerPoint presentation program. PowerPoint was originally designed to provide visuals for group presentations within business organizations, but has come to be very widely used in many other communication situations, both in business and beyond.

PS
top concept of: file-type
type: Concept
in scheme: file-type
notation: PS
notation: application/postscript
notation: ps
definition: PS – PostScript – is a page description language in the electronic publishing and desktop publishing business. It is a dynamically typed, concatenative programming language.

PSD
top concept of: file-type
type: Concept
in scheme: file-type
notation: PSD
notation: application/x-photoshop
notation: psd
definition: PSD – Photoshop Document – stores an image with support for most imaging options available in Adobe Photoshop. Photoshop is a raster graphics editor.

RAR
top concept of: file-type
type: Concept
in scheme: file-type
notation: RAR
notation: application/vnd.rar
notation: r00
notation: r01
notation: rar
notation: rev
definition: RAR is a proprietary archive file format that supports data compression, error recovery and file spanning.

RDFa
top concept of: file-type
type: Concept
in scheme: file-type
notation: RDFA
notation: application/rdfa
notation: rdfa
definition: RDFa is a technique that provides a set of markup attributes to augment the visual information on the Web with machine-readable hints.

RDF N-Quads
top concept of: file-type
type: Concept
in scheme: file-type
notation: RDF_N_QUADS
notation: application/n-quads
notation: nq
definition: N-Quads is a line-based, plain text format for encoding an RDF dataset. N-quads statements are a sequence of RDF terms representing the subject, predicate, object and graph label of an RDF Triple and the graph it is part of in a dataset.

RDF N-Triples
top concept of: file-type
type: Concept
in scheme: file-type
notation: RDF_N_TRIPLES
notation: application/n-triples
notation: nt
definition: RDF N-Tirples is a line-based, plain text format for encoding an RDF graph; a concrete syntax for RDF, an easy to parse line-based subset of Turtle.

RDF TriG
top concept of: file-type
type: Concept
in scheme: file-type
notation: RDF_TRIG
notation: application/trig
notation: trig
definition: TriG allows an RDF dataset to be completely written in a compact and natural text form, with abbreviations for common usage patterns and datatypes. TriG is an extension of the Turtle format.

RDF TriX
top concept of: file-type
type: Concept
in scheme: file-type
notation: RDF_TRIX
notation: application/xml
notation: trix
notation: xml
definition: TriX (Triples in XML) is a serialization format for RDF (Resource Description Framework) graphs. It is an XML format for serializing Named Graphs and RDF Datasets which offers a compact and readable alternative to the XML-based RDF/XML syntax.

RDF Turtle
top concept of: file-type
type: Concept
in scheme: file-type
notation: RDF_TURTLE
notation: text/turtle
notation: ttl
definition: Turtle – Terse RDF Triple Language – is a format for expressing data in the Resource Description Framework (RDF) data model with a syntax similar to SPARQL. RDF, in turn, represents information using ‘triples’, each of which consists of a subject, a predicate and an object. Each of those items is expressed as a Web URI.

RDF XML
top concept of: file-type
type: Concept
in scheme: file-type
notation: RDF_XML
notation: application/rdf+xml
notation: rdf
definition: RDF XML is a syntax, defined by the W3C, to express (i.e. serialize) an RDF graph as an XML document.

RSS feed
top concept of: file-type
type: Concept
in scheme: file-type
notation: RSS
notation: application/rss+xml
notation: rss
notation: xml
definition: RSS – Rich Site Summary; originally RDF Site Summary; often called Really Simple Syndication – is a type of web feed which allows users to access updates to online content in a standardized, computer-readable format. These feeds can, for example, allow a user to keep track of many different websites in a single news aggregator. Websites usually use RSS feeds to publish frequently updated information, such as blog entries, news headlines, audio, video. An RSS document (called ‘feed’, ‘web feed’ or ‘channel’) includes full or summarized text and metadata.

RTF
top concept of: file-type
type: Concept
in scheme: file-type
notation: RTF
notation: rtf
notation: text/rtf
definition: RTF – Rich Text Format – is a proprietary document file format developed for cross-platform document interchange with Microsoft products.

XML schema
top concept of: file-type
type: Concept
in scheme: file-type
notation: SCHEMA_XML
notation: application/xml
notation: xsd
definition: An XML schema is a description of a type of XML document, typically expressed in terms of constraints on the structure and content of documents of that type, above and beyond the basic syntactical constraints imposed by XML itself.

SGML
top concept of: file-type
type: Concept
in scheme: file-type
notation: SGML
notation: sgm
notation: sgml
notation: text/sgml
definition: SGML – Standard Generalized Markup Language – is a standard for defining generalized markup languages for documents. Generalized markup is based on two postulates: markup should be declarative and rigorous.

Esri Shape
top concept of: file-type
type: Concept
in scheme: file-type
notation: SHP
notation: application/x-shapefile
notation: dbf
notation: shp
notation: shx
definition: SHP – shapefile format – is a popular geospatial vector data format for geographic information system (GIS) software. Esri shapefile is a zip archive that contains at least the shp, shx and dbf files.

SKOS
top concept of: file-type
type: Concept
in scheme: file-type
notation: SKOS_XML
notation: application/rdf+xml
notation: rdf
definition: SKOS – Simple Knowledge Organization System – is a W3C recommendation designed for representation of thesauri, classification schemes, taxonomies, subject-heading systems or any other type of structured controlled vocabulary. XML – Extensible Markup Language – is a markup language that defines a set of rules for encoding documents in a format that is both human-readable and machine-readable.

SPARQL
top concept of: file-type
type: Concept
in scheme: file-type
notation: SPARQLQ
notation: application/sparql-query
notation: rq
notation: sparqlq
definition: SPARQL – a recursive acronym for SPARQL Protocol and RDF Query Language – is an RDF query language, that is, a semantic query language for databases, able to retrieve and manipulate data stored in Resource Description Framework (RDF) format. It is recognised as one of the key technologies of the semantic web.

SPARQL results
top concept of: file-type
type: Concept
in scheme: file-type
notation: SPARQLQRES
notation: application/sparql-results+xml
notation: sparqlqr
notation: srx
definition: Results of a SPARQL query. SPARQL – SPARQL Protocol and RDF Query Language – is an RDF query language, that is, a semantic query language for databases, able to retrieve and manipulate data stored in Resource Description Framework (RDF) format.

SVG
top concept of: file-type
type: Concept
in scheme: file-type
notation: SVG
notation: image/svg+xml
notation: svg
notation: svgz
definition: Open standard for two-dimensional vector graphics.

TAR
top concept of: file-type
type: Concept
in scheme: file-type
notation: TAR
notation: application/x-tar
notation: tar
definition: TAR – tape archive – is a computer software utility for collecting many files into one archive file for distribution or backup purposes.

TAR XZ
top concept of: file-type
type: Concept
in scheme: file-type
notation: TAR_XZ
notation: application/x-compressed
notation: tar.xz
definition: TAR – tape archive – is a computer software utility for collecting many files into one archive file, often referred to as a tarball, for distribution or backup purposes. XZ is a lossless compression program and file format.

TIFF
top concept of: file-type
type: Concept
in scheme: file-type
notation: TIFF
notation: image/tiff
notation: tif
notation: tiff
definition: TIFF – Tagged Image File Format – is a computer file format for storing raster graphics images, popular among graphic artists, the publishing industry and photographers. TIFF is widely supported by scanning, faxing, word processing, optical character recognition, image manipulation, desktop publishing and page-layout applications. The format was created by Aldus Corporation for use in desktop publishing.

TSV
top concept of: file-type
type: Concept
in scheme: file-type
notation: TSV
notation: tab
notation: text/tab-separated-values
notation: tsv
definition: TSV – tab-separated values – files are a simple text format for storing data in a tabular structure, e.g. database table or spreadsheet data, and a way of exchanging information between databases. Each record in the table is one line of the text file. Each field value of a record is separated from the next by a tab character.

Plain text
top concept of: file-type
type: Concept
in scheme: file-type
notation: TXT
notation: text/plain
notation: txt
definition: Plain text is the data (e.g. file contents) that represent only characters of readable material but not its graphical representation nor other objects. It may also include a limited number of characters that control simple arrangement of text, such as line breaks or tabulation characters. Plain text is different from formatted text, where style information is included, and from ‘binary files’ in which some portions must be interpreted as binary objects (encoded integers, real numbers, images, etc.).

WFS
top concept of: file-type
type: Concept
in scheme: file-type
notation: WFS_SRVC
notation: application/gml+xml
notation: text/xml
definition: The Open Geospatial Consortium Web Feature Service (WFS) Interface Standard provides an interface allowing requests for geospatial features across the web using platform-independent mechanisms and is independent of the underlying data store.

WMS
top concept of: file-type
type: Concept
in scheme: file-type
notation: WMS_SRVC
notation: application/vnd.ogc.wms_xml
notation: text/xml
definition: A Web Map Service (WMS) is a standard protocol developed by the Open Geospatial Consortium (OGC) for serving georeferenced map images over the Internet. These images are typically produced by a map server from data provided by a geographic information system (GIS) database.

XHTML
top concept of: file-type
type: Concept
in scheme: file-type
notation: XHTML
notation: application/xhtml+xml
notation: htm
notation: html
notation: xht
notation: xhtml
definition: XHTML is a family of current and future document types and modules that reproduce, subset and extend HTML 4. XHTML family document types are XML based.

Excel XLS
top concept of: file-type
type: Concept
in scheme: file-type
notation: XLS
notation: application/vnd.ms-excel
notation: xls
definition: XLS is a proprietary binary file format used for Microsoft Excel spreadsheet which features calculation, graphing tools, pivot tables and a macro programming language.

Excel XLSX
top concept of: file-type
type: Concept
in scheme: file-type
notation: XLSX
notation: application/vnd.openxmlformats-officedocument.spreadsheetml.sheet
notation: xlsx
definition: XLSX is the default file format for Excel 2007 and later workbook used for Microsoft Excel spreadsheet which features calculation, graphing tools, pivot tables and a macro programming language. XLSX is in reality a ZIP compressed archive with a directory structure of XML text documents.

XML
top concept of: file-type
type: Concept
in scheme: file-type
notation: XML
notation: application/xml
notation: xml
definition: XML – Extensible Markup Language – is a markup language that defines a set of rules for encoding documents in a format that is both human-readable and machine-readable. The design goals of XML emphasize simplicity, generality and usability across the Internet.

XSL-FO
top concept of: file-type
type: Concept
in scheme: file-type
notation: XSLFO
notation: application/xml
notation: fo
definition: XSL-FO – XSL Formatting Objects – is a markup language for XML document formatting that is most often used to generate PDF files. XSL-FO is part of XSL (Extensible Stylesheet Language), a set of W3C technologies designed for the transformation and formatting of XML data.

XSLT
top concept of: file-type
type: Concept
in scheme: file-type
notation: XSLT
notation: application/xslt+xml
notation: xsl
notation: xslt
definition: XSLT – Extensible Stylesheet Language Transformations – is a language for transforming XML documents into other XML documents or other formats such as HTML for web pages, plain text or XSL Formatting Objects, which may subsequently be converted to other formats, such as PDF, PostScript and PNG.

ZIP
top concept of: file-type
type: Concept
in scheme: file-type
notation: ZIP
notation: application/zip
notation: zip
definition: ZIP is an archive file format that supports lossless data compression. A ZIP file may contain one or more files or directories that may have been compressed.

NetCDF
top concept of: file-type
type: Concept
in scheme: file-type
notation: NetCDF

file-type
type: ConceptScheme

7z
top concept of: file-type
type: Concept
in scheme: file-type
notation: 7z
notation: 7-Zip compressed file
definition: 7z is a compressed archive file format that supports several different data compression, encryption and pre-processing algorithms.